gpt4 book ai didi

android - Flutter:任务 ':agora_rtc_engine:compileDebugKotlin' 执行失败

转载 作者:行者123 更新时间:2023-12-05 00:01:50 29 4
gpt4 key购买 nike

我正在做一个旧项目。它在 5 天前运行良好。现在我正面临agora 的错误。我之前的代码没有任何改变。
这是错误-

FAILURE: Build failed with an exception.

* What went wrong:
Execution failed for task ':agora_rtc_engine:compileDebugKotlin'.
> Could not resolve all files for configuration ':agora_rtc_engine:debugCompileClasspath'.
> Could not find native-full-sdk-3.4.6.jar (com.github.agorabuilder:native-full-sdk:3.4.6).
Searched in the following locations:
https://www.jitpack.io/com/github/agorabuilder/native-full-sdk/3.4.6/native-full-sdk-3.4.6.jar

* Try:
Run with --stacktrace option to get the stack trace. Run with --info or --debug option to get more log output. Run with --scan to get full insights.

* Get more help at https://help.gradle.org

BUILD FAILED in 38s
Running Gradle task 'assembleDebug'... 40.0s
Exception: Gradle task assembleDebug failed with exit code 1
我正在使用 agora_rtc_engine: ^3.3.1因为这个项目在没有零安全性的情况下开发(可能是 flutter 1.5)。我怎么解决这个问题 ?

最佳答案

1.运行 flutter 升级在终端升级 Flutter
2.运行飞镖迁移 运行 dart 迁移工具
3.解决迁移工具显示的所有错误
4.运行 Flutter pub 已过时 --mode=null-safety 打印所有过时的包
5.运行 flutter 酒吧升级--null-safety 自动升级所有软件包
6.检查代码是否有错误并解决
7.运行飞镖迁移 再次,现在应该成功了。按照链接检查建议的更改
8.按“应用迁移”按钮
9.再次检查代码是否有错误并修复它们。
在命令行中运行flutter run,应用程序应该运行......
注意:如果您的项目中有任何不支持空安全的库,您必须升级该库。如果该库没有空安全性,请删除该库并使用另一个库

关于android - Flutter:任务 ':agora_rtc_engine:compileDebugKotlin' 执行失败,我们在Stack Overflow上找到一个类似的问题: https://stackoverflow.com/questions/72292626/

29 4 0
Copyright 2021 - 2024 cfsdn All Rights Reserved 蜀ICP备2022000587号
广告合作:1813099741@qq.com 6ren.com