- html - 出于某种原因,IE8 对我的 Sass 文件中继承的 html5 CSS 不友好?
- JMeter 在响应断言中使用 span 标签的问题
- html - 在 :hover and :active? 上具有不同效果的 CSS 动画
- html - 相对于居中的 html 内容固定的 CSS 重复背景?
我先在这里问过...但没有得出结论。请先看看这篇文章。
===现状===
mvn -ecompile exec:java
”)mvn -e clean exec:java
”)Maven 找不到我的 mainClass mvn -e clean exec:java -Dexec.mainClass=com.jadex.qna.MavenTestProject.App
”显式声明我的主类。但它给了我同样的错误结果。===数据===
这是我的完整代码(包括pom.xml
,你可以用eclipse打开项目)
这是我使用“mvn -e clean exec:java
”运行项目时显示的错误日志(与上一篇文章中的 EDIT5 相同)
[WARNING]
[WARNING] Some problems were encountered while building the effective settings
[WARNING] expected START_TAG or END_TAG not TEXT (position: TEXT seen ...ore artifacts.\n |\n | Default: ${user.home}/.m2/repository\n <l... @53:5) @ C:\apache-maven-3.3.3\conf\settings.xml, line 53, column 5
[WARNING] expected START_TAG or END_TAG not TEXT (position: TEXT seen ...ore artifacts.\n |\n | Default: ${user.home}/.m2/repository\n <l... @53:5) @ C:\apache-maven-3.3.3\conf\settings.xml, line 53, column 5
[WARNING]
[INFO] Scanning for projects...
[INFO]
[INFO] ------------------------------------------------------------------------
[INFO] Building MavenTestProject 0.0.1-SNAPSHOT
[INFO] ------------------------------------------------------------------------
[INFO]
[INFO] --- maven-clean-plugin:2.5:clean (default-clean) @ MavenTestProject ---
[INFO] Deleting C:\Users\bonavision_laptop\Desktop\Project\JadeX\MavenTestProject\MavenTestProject\target
[INFO]
[INFO] --- exec-maven-plugin:1.4.0:java (default-cli) @ MavenTestProject ---
[WARNING]
java.lang.ClassNotFoundException: com.jadex.qna.MavenTestProject.App
at java.net.URLClassLoader.findClass(URLClassLoader.java:381)
at java.lang.ClassLoader.loadClass(ClassLoader.java:424)
at java.lang.ClassLoader.loadClass(ClassLoader.java:357)
at org.codehaus.mojo.exec.ExecJavaMojo$1.run(ExecJavaMojo.java:281)
at java.lang.Thread.run(Thread.java:745)
[INFO] ------------------------------------------------------------------------
[INFO] BUILD FAILURE
[INFO] ------------------------------------------------------------------------
[INFO] Total time: 0.900 s
[INFO] Finished at: 2015-06-15T17:42:19+09:00
[INFO] Final Memory: 8M/153M
[INFO] ------------------------------------------------------------------------
[ERROR] Failed to execute goal org.codehaus.mojo:exec-maven-plugin:1.4.0:java (default-cli) on project MavenTestProject: An exception occured while executing the Java class. com.jadex.qna.MavenTestProject.App -> [Help 1]
[ERROR]
[ERROR] To see the full stack trace of the errors, re-run Maven with the -e switch.
[ERROR] Re-run Maven using the -X switch to enable full debug logging.
[ERROR]
[ERROR] For more information about the errors and possible solutions, please read the following articles:
[ERROR] [Help 1] http://cwiki.apache.org/confluence/display/MAVEN/MojoExecutionException
有什么办法可以解决吗?我已经被困在这个问题里四天了...请帮忙T_T
最佳答案
如果运行mvn clean exec:java
,所有已编译的类都会被clean
删除,因此exec:java
无法找到要执行的类。
如果您运行mvn cleancompile exec:java
。 clean
删除以前的版本中可能存在的所有已编译类。 compile
编译所有源代码并exec:java
执行指定的类。
如果输出不是您所期望的,也许您应该更好地描述您想要实现的目标。
输出
[INFO] Error stacktraces are turned on.
[INFO] Scanning for projects...
[INFO]
[INFO] ------------------------------------------------------------------------
[INFO] Building MavenTestProject 0.0.1-SNAPSHOT
[INFO] ------------------------------------------------------------------------
[INFO]
[INFO] --- maven-clean-plugin:2.4.1:clean (default-clean) @ MavenTestProject ---
[INFO] Deleting /tmp/MavenTestProject/target
[INFO]
[INFO] --- maven-resources-plugin:2.5:resources (default-resources) @ MavenTestProject ---
[debug] execute contextualize
[INFO] Using 'UTF-8' encoding to copy filtered resources.
[INFO] skip non existing resourceDirectory /tmp/MavenTestProject/src/main/resources
[INFO]
[INFO] --- maven-compiler-plugin:2.3.2:compile (default-compile) @ MavenTestProject ---
[INFO] Compiling 1 source file to /tmp/MavenTestProject/target/classes
[INFO]
[INFO] --- exec-maven-plugin:1.4.0:java (default-cli) @ MavenTestProject ---
Hello World!?
[INFO] ------------------------------------------------------------------------
[INFO] BUILD SUCCESS
[INFO] ------------------------------------------------------------------------
[INFO] Total time: 0.934s
[INFO] Finished at: Mon Jun 15 12:08:36 CEST 2015
[INFO] Final Memory: 8M/19M
[INFO] ------------------------------------------------------------------------
关于java - exec-maven-plugin 错误...可以编译,但无法运行项目,我们在Stack Overflow上找到一个类似的问题: https://stackoverflow.com/questions/30841617/
我通过 spring ioc 编写了一些 Rest 应用程序。但我无法解决这个问题。这是我的异常(exception): org.springframework.beans.factory.BeanC
我对 TestNG、Spring 框架等完全陌生,我正在尝试使用注释 @Value通过 @Configuration 访问配置文件注释。 我在这里想要实现的目标是让控制台从配置文件中写出“hi”,通过
为此工作了几个小时。我完全被难住了。 这是 CS113 的实验室。 如果用户在程序(二进制计算器)结束时选择继续,我们需要使用 goto 语句来到达程序的顶部。 但是,我们还需要释放所有分配的内存。
我正在尝试使用 ffmpeg 库构建一个小的 C 程序。但是我什至无法使用 avformat_open_input() 打开音频文件设置检查错误代码的函数后,我得到以下输出: Error code:
使用 Spring Initializer 创建一个简单的 Spring boot。我只在可用选项下选择 DevTools。 创建项目后,无需对其进行任何更改,即可正常运行程序。 现在,当我尝试在项目
所以我只是在 Mac OS X 中通过 brew 安装了 qt。但是它无法链接它。当我尝试运行 brew link qt 或 brew link --overwrite qt 我得到以下信息: ton
我在提交和 pull 时遇到了问题:在提交的 IDE 中,我看到: warning not all local changes may be shown due to an error: unable
我跑 man gcc | grep "-L" 我明白了 Usage: grep [OPTION]... PATTERN [FILE]... Try `grep --help' for more inf
我有一段代码,旨在接收任何 URL 并将其从网络上撕下来。到目前为止,它运行良好,直到有人给了它这个 URL: http://www.aspensurgical.com/static/images/a
在过去的 5 个小时里,我一直在尝试在我的服务器上设置 WireGuard,但在完成所有设置后,我无法 ping IP 或解析域。 下面是服务器配置 [Interface] Address = 10.
我正在尝试在 GitLab 中 fork 我的一个私有(private)项目,但是当我按下 fork 按钮时,我会收到以下信息: No available namespaces to fork the
我这里遇到了一些问题。我是 node.js 和 Rest API 的新手,但我正在尝试自学。我制作了 REST API,使用 MongoDB 与我的数据库进行通信,我使用 Postman 来测试我的路
下面的代码在控制台中给出以下消息: Uncaught DOMException: Failed to execute 'appendChild' on 'Node': The new child el
我正在尝试调用一个新端点来显示数据,我意识到在上一组有效的数据中,它在数据周围用一对额外的“[]”括号进行控制台,我认为这就是问题是,而新端点不会以我使用数据的方式产生它! 这是 NgFor 失败的原
我正在尝试将我的 Symfony2 应用程序部署到我的 Azure Web 应用程序,但遇到了一些麻烦。 推送到远程时,我在终端中收到以下消息 remote: Updating branch 'mas
Minikube已启动并正在运行,没有任何错误,但是我无法 curl IP。我在这里遵循:https://docs.traefik.io/user-guide/kubernetes/,似乎没有提到关闭
每当我尝试docker组成任何项目时,都会出现以下错误。 我尝试过有和没有sudo 我在这台机器上只有这个问题。我可以在Mac和Amazon WorkSpace上运行相同的容器。 (myslabs)
我正在尝试 pip install stanza 并收到此消息: ERROR: No matching distribution found for torch>=1.3.0 (from stanza
DNS 解析看起来不错,但我无法 ping 我的服务。可能是什么原因? 来自集群中的另一个 Pod: $ ping backend PING backend.default.svc.cluster.l
我正在使用Hibernate 4 + Spring MVC 4当我开始 Apache Tomcat Server 8我收到此错误: Error creating bean with name 'wel
我是一名优秀的程序员,十分优秀!