- html - 出于某种原因,IE8 对我的 Sass 文件中继承的 html5 CSS 不友好?
- JMeter 在响应断言中使用 span 标签的问题
- html - 在 :hover and :active? 上具有不同效果的 CSS 动画
- html - 相对于居中的 html 内容固定的 CSS 重复背景?
我有一个由 Maven 管理的小实验项目。它使用一个库来生成 PDF。这是我的 pom.xml
:
<project xmlns="http://maven.apache.org/POM/4.0.0" xmlns:xsi="http://www.w3.org/2001/XMLSchema-instance"
xsi:schemaLocation="http://maven.apache.org/POM/4.0.0 http://maven.apache.org/xsd/maven-4.0.0.xsd">
<modelVersion>4.0.0</modelVersion>
<groupId>br.com.brandizzi.adam.pdfize</groupId>
<artifactId>pdfize</artifactId>
<version>0.0.1-SNAPSHOT</version>
<dependencies>
<dependency>
<groupId>org.xhtmlrenderer</groupId>
<artifactId>core-renderer</artifactId>
<version>R8pre2</version>
<scope>runtime</scope>
</dependency>
</dependencies>
</project>
它只有一个类:
package br.com.brandizzi.adam.pdfize;
//
public class Main {
public static void main(String[] args) throws DocumentException,
MalformedURLException, FileNotFoundException {
String inputUrl = new File(args[0]).toURI().toURL().toString();
OutputStream pdf = new FileOutputStream(args[1]);
ITextRenderer renderer = new ITextRenderer();
renderer.setDocument(inputUrl);
renderer.layout();
renderer.createPDF(pdf);
}
}
但是,当我运行 mvn compile
时,出现了这个错误:
$ mvn compile
[INFO] Scanning for projects...
[INFO]
[INFO] ------------------------------------------------------------------------
[INFO] Building pdfize 0.0.1-SNAPSHOT
[INFO] ------------------------------------------------------------------------
[INFO]
[INFO] --- maven-resources-plugin:2.5:resources (default-resources) @ pdfize ---
[debug] execute contextualize
[WARNING] Using platform encoding (UTF-8 actually) to copy filtered resources, i.e. build is platform dependent!
[INFO] Copying 0 resource
[INFO]
[INFO] --- maven-compiler-plugin:2.3.2:compile (default-compile) @ pdfize ---
[WARNING] File encoding has not been set, using platform encoding UTF-8, i.e. build is platform dependent!
[INFO] Compiling 1 source file to /home/adam/software/workspaces/test/pdfize/target/classes
[INFO] -------------------------------------------------------------
[ERROR] COMPILATION ERROR :
[INFO] -------------------------------------------------------------
[ERROR] /home/adam/software/workspaces/test/pdfize/src/main/java/br/com/brandizzi/adam/pdfize/Main.java:[9,28] error: package org.xhtmlrenderer.pdf does not exist
[ERROR] /home/adam/software/workspaces/test/pdfize/src/main/java/br/com/brandizzi/adam/pdfize/Main.java:[11,23] error: package com.lowagie.text does not exist
[ERROR] /home/adam/software/workspaces/test/pdfize/src/main/java/br/com/brandizzi/adam/pdfize/Main.java:[38,3] error: cannot find symbol
[ERROR] class Main
/home/adam/software/workspaces/test/pdfize/src/main/java/br/com/brandizzi/adam/pdfize/Main.java:[29,11] error: cannot find symbol
[ERROR] class Main
/home/adam/software/workspaces/test/pdfize/src/main/java/br/com/brandizzi/adam/pdfize/Main.java:[43,2] error: cannot find symbol
[ERROR] class Main
/home/adam/software/workspaces/test/pdfize/src/main/java/br/com/brandizzi/adam/pdfize/Main.java:[43,31] error: cannot find symbol
[INFO] 6 errors
[INFO] -------------------------------------------------------------
[INFO] ------------------------------------------------------------------------
[INFO] BUILD FAILURE
[INFO] ------------------------------------------------------------------------
[INFO] Total time: 1.094s
[INFO] Finished at: Sat Mar 30 21:36:59 BRT 2013
[INFO] Final Memory: 9M/106M
[INFO] ------------------------------------------------------------------------
[ERROR] Failed to execute goal org.apache.maven.plugins:maven-compiler-plugin:2.3.2:compile (default-compile) on project pdfize: Compilation failure: Compilation failure:
[ERROR] /home/adam/software/workspaces/test/pdfize/src/main/java/br/com/brandizzi/adam/pdfize/Main.java:[9,28] error: package org.xhtmlrenderer.pdf does not exist
[ERROR] /home/adam/software/workspaces/test/pdfize/src/main/java/br/com/brandizzi/adam/pdfize/Main.java:[11,23] error: package com.lowagie.text does not exist
[ERROR] /home/adam/software/workspaces/test/pdfize/src/main/java/br/com/brandizzi/adam/pdfize/Main.java:[38,3] error: cannot find symbol
[ERROR] class Main
[ERROR] /home/adam/software/workspaces/test/pdfize/src/main/java/br/com/brandizzi/adam/pdfize/Main.java:[29,11] error: cannot find symbol
[ERROR] class Main
[ERROR] /home/adam/software/workspaces/test/pdfize/src/main/java/br/com/brandizzi/adam/pdfize/Main.java:[43,2] error: cannot find symbol
[ERROR] class Main
[ERROR] /home/adam/software/workspaces/test/pdfize/src/main/java/br/com/brandizzi/adam/pdfize/Main.java:[43,31] error: cannot find symbol
[ERROR] -> [Help 1]
[ERROR]
[ERROR] To see the full stack trace of the errors, re-run Maven with the -e switch.
[ERROR] Re-run Maven using the -X switch to enable full debug logging.
[ERROR]
[ERROR] For more information about the errors and possible solutions, please read the following articles:
[ERROR] [Help 1] http://cwiki.apache.org/confluence/display/MAVEN/MojoFailureException
出了什么问题?
最佳答案
问题是依赖配置设置为runtime
应该使用 compile
的范围范围。所以,<dependency>
pom.xml
上的元素应该改成这样:
<dependencies>
<dependency>
<groupId>org.xhtmlrenderer</groupId>
<artifactId>core-renderer</artifactId>
<version>R8pre2</version>
<scope>compile</scope> <!-- <== NOTE THE DIFFERENCE -->
</dependency>
</dependencies>
当然,这引发了一个问题,即为什么我会尝试使用 runtime
范围放在首位。我试图构建一个包含所有依赖项的 JAR,如果您也尝试这样做,那么更改范围就没有意义了。相反,请遵循此 awesome answer .
关于java - Maven 找不到编译类型的依赖项,我们在Stack Overflow上找到一个类似的问题: https://stackoverflow.com/questions/15725268/
我正在尝试编写一个相当多态的库。我遇到了一种更容易表现出来却很难说出来的情况。它看起来有点像这样: {-# LANGUAGE ScopedTypeVariables #-} {-# LANGUAGE
谁能解释一下这个表达式是如何工作的? type = type || 'any'; 这是否意味着如果类型未定义则使用“任意”? 最佳答案 如果 type 为“falsy”(即 false,或 undef
我有一个界面,在IAnimal.fs中, namespace Kingdom type IAnimal = abstract member Eat : Food -> unit 以及另一个成功
这个问题在这里已经有了答案: 关闭 10 年前。 Possible Duplicate: What is the difference between (type)value and type(va
在 C# 中,default(Nullable) 之间有区别吗? (或 default(long?) )和 default(long) ? Long只是一个例子,它可以是任何其他struct类型。 最
假设我有一个案例类: case class Foo(num: Int, str: String, bool: Boolean) 现在我还有一个简单的包装器: sealed trait Wrapper[
这个问题在这里已经有了答案: Create C# delegate type with ref parameter at runtime (1 个回答) 关闭 2 年前。 为了即时创建委托(dele
我正在尝试获取图像的 dct。一开始我遇到了错误 The function/feature is not implemented (Odd-size DCT's are not implemented
我正在尝试使用 AFNetworking 的 AFPropertyListRequestOperation,但是当我尝试下载它时,出现错误 预期的内容类型{( “应用程序/x-plist” )}, 得
我在下面收到错误。我知道这段代码的意思,但我不知道界面应该是什么样子: Element implicitly has an 'any' type because index expression is
我尝试将 SignalType 从 ReactiveCocoa 扩展为自定义 ErrorType,代码如下所示 enum MyError: ErrorType { // .. cases }
我无法在任何其他问题中找到答案。假设我有一个抽象父类(super class) Abstract0,它有两个子类 Concrete1 和 Concrete1。我希望能够在 Abstract0 中定义类
我想知道为什么这个索引没有用在 RANGE 类型中,而是用在 INDEX 中: 索引: CREATE INDEX myindex ON orders(order_date); 查询: EXPLAIN
我正在使用 RxJava,现在我尝试通过提供 lambda 来订阅可观察对象: observableProvider.stringForKey(CURRENT_DELETED_ID) .sub
我已经尝试了几乎所有解决问题的方法,其中包括。为 提供类型使用app.use(express.static('public'))还有更多,但我似乎无法为此找到解决方案。 index.js : imp
以下哪个 CSS 选择器更快? input[type="submit"] { /* styles */ } 或 [type="submit"] { /* styles */ } 只是好
我不知道这个设置有什么问题,我在 IDEA 中获得了所有注释(@Controller、@Repository、@Service),它在行号左侧显示 bean,然后转到该 bean。 这是错误: 14-
我听从了建议 registering java function as a callback in C function并且可以使用“简单”类型(例如整数和字符串)进行回调,例如: jstring j
有一些 java 类,加载到 Oracle 数据库(版本 11g)和 pl/sql 函数包装器: create or replace function getDataFromJava( in_uLis
我已经从 David Walsh 的 css 动画回调中获取代码并将其修改为 TypeScript。但是,我收到一个错误,我不知道为什么: interface IBrowserPrefix { [
我是一名优秀的程序员,十分优秀!