- Java 双重比较
- java - 比较器与 Apache BeanComparator
- Objective-C 完成 block 导致额外的方法调用?
- database - RESTful URI 是否应该公开数据库主键?
创建 apache Abdera 客户端失败
我的部分代码是
Abdera abdera = new Abdera();
AbderaClient abderaClient = new AbderaClient(abdera);
这让我很震惊......
java.lang.RuntimeException: java.lang.NoSuchMethodException: org.apache.abdera.protocol.client.cache.LRUCacheFactory.<init>(org.apache.abdera.Abdera)
at org.apache.abdera.util.Discover.locate(Discover.java:37)
at org.apache.abdera.util.Discover.locate(Discover.java:21)
at org.apache.abdera.util.ServiceUtil.newInstance(ServiceUtil.java:142)
at org.apache.abdera.protocol.client.AbderaClient.initCacheFactory(AbderaClient.java:132)
at org.apache.abdera.protocol.client.AbderaClient.<init>(AbderaClient.java:108)
at org.apache.abdera.protocol.client.AbderaClient.<init>(AbderaClient.java:9
at sun.reflect.NativeMethodAccessorImpl.invoke0(Native Method)
at sun.reflect.NativeMethodAccessorImpl.invoke(NativeMethodAccessorImpl.java:39)
at sun.reflect.DelegatingMethodAccessorImpl.invoke(DelegatingMethodAccessorImpl.java:25)
at org.junit.runners.model.FrameworkMethod$1.runReflectiveCall(FrameworkMethod.java:47)
at org.junit.internal.runners.model.ReflectiveCallable.run(ReflectiveCallable.java:12)
at org.junit.runners.model.FrameworkMethod.invokeExplosively(FrameworkMethod.java:44)
at org.junit.internal.runners.statements.InvokeMethod.evaluate(InvokeMethod.java:17)
at org.junit.internal.runners.statements.RunBefores.evaluate(RunBefores.java:26)
at org.junit.rules.ExpectedException$ExpectedExceptionStatement.evaluate(ExpectedException.java:168)
at org.junit.rules.RunRules.evaluate(RunRules.java:20)
at org.junit.runners.ParentRunner.runLeaf(ParentRunner.java:271)
at org.junit.runners.BlockJUnit4ClassRunner.runChild(BlockJUnit4ClassRunner.java:70)
at org.junit.runners.BlockJUnit4ClassRunner.runChild(BlockJUnit4ClassRunner.java:50)
at org.junit.runners.ParentRunner$3.run(ParentRunner.java:238)
at org.junit.runners.ParentRunner$1.schedule(ParentRunner.java:63)
at org.junit.runners.ParentRunner.runChildren(ParentRunner.java:236)
at org.junit.runners.ParentRunner.access$000(ParentRunner.java:53)
at org.junit.runners.ParentRunner$2.evaluate(ParentRunner.java:229)
at org.junit.runners.ParentRunner.run(ParentRunner.java:309)
at org.junit.runner.JUnitCore.run(JUnitCore.java:160)
at com.intellij.rt.execution.junit.JUnitStarter.main(JUnitStarter.java:65)
Caused by: java.lang.NoSuchMethodException: org.apache.abdera.protocol.client.cache.LRUCacheFactory.<init>(org.apache.abdera.Abdera)
at java.lang.Class.getConstructor0(Class.java:2706)
at java.lang.Class.getConstructor(Class.java:1657)
at org.apache.abdera.util.Discover.load(Discover.java:149)
at org.apache.abdera.util.Discover.locate(Discover.java:33)
... 30 more
任何帮助!!
最佳答案
显然看起来像是 AbderaClient
的以下方法中的错误;它使用反射来定位 LRUCacheFactory 的构造函数:
private CacheFactory initCacheFactory() {
CacheFactory cacheFactory =
(CacheFactory)Discover.locate(
CacheFactory.class.getName(),
LRUCacheFactory.class.getName(),
abdera);
return cacheFactory;
}
检查你的LRUCacheFactory
版本中是否有这样的构造函数。
建议切换到最新的 Abdera 版本 (1.1.3)。但是,我在论坛中也找到了解决方法。试试它是否有效。
AbderaClient client;
ClassLoader originalClassLoader = Thread.currentThread().getContextClassLoader();
try {
ClassLoader cl = this.getClass().getClassLoader();
Thread.currentThread().setContextClassLoader(cl);
Abdera abdera = new Abdera();
client = new AbderaClient(abdera);
// Do something with client
} finally {
// Restore original classloader
Thread.currentThread().setContextClassLoader(originalClassLoader);
}
引用this link有关此解决方法的更多详细信息。
关于java - 创建 Abdera 客户端失败,我们在Stack Overflow上找到一个类似的问题: https://stackoverflow.com/questions/21904319/
我在使用以下代码时遇到问题: function http_file_exists($url){ $f=fopen($url,"r"); if($f){ fclose($f); retu
我已经通过 Git 部署到 Azure 几个月了,没有出现重大问题,但现在我似乎遇到了一个无法克服的错误。 我创建了一个新的 Azure 网站,为正在开发的项目创建单独的预览链接。我在新站点上设置了
我已经通过flutter创建了一个App并完成了它,我想在flutter文档中阅读时进行部署。 我收到此错误: FAILURE: Build failed with an exception. * W
我在Windows 10中使用一些简单的Powershell代码遇到了这个奇怪的问题,我认为这可能是我做错了,但我不是Powershell的天才。 我有这个: $ix = [System.Net.Dn
我正在尝试使用 RapidJSON 解析从服务器接收到的数据。以下是收到的确切字符串: [ { "Node": "9478149a08f9", "Address": "172.17
我尝试为 ios 编译 OpenCV。我总是收到这些错误。我用不同版本的opencv试了一下,结果都是一样的。 我运行这个:python 平台/ios/build_framework.py ios_o
我在一台机器上做基本的发布/订阅,我的客户端是 StackExchange-Redis 的 C# 客户端,我在同一台机器上运行基于 Windows 的 Redis 服务器(服务器版本 2.8.4) 当
我有这段代码,但无法执行,请帮我解决这个问题 连接 connect_error) { die ("connection failed: " . $terhubung->connect_erro
我在 tomcat 上运行并由 maven 编译的 Web 应用程序给出了以下警告和错误。我可以在本地存储库中看到所有 JAR,但有人可以帮忙吗。 WARNING: Failed to scan JA
我正在 Windows 8 上使用 Android Studio 开发一个 android 应用程序,我正在使用一些 native 代码。突然间我无法编译我的 C 文件。当我运行 ndk-build
下面的代码对类和结构的成员进行序列化和反序列化。序列化工作正常,但我在尝试使用 oarch >> BOOST_SERIALIZATION_NVP(outObj); 反序列化时遇到了以下错误; 代码中是
如果我运行此命令“rspec ./spec/requests/api/v1/password_reset_request_spec.rb”,此文件中的所有测试都会通过。 但是,当我运行“rspec”时
我在尝试执行测试以使用 Protractor 上传文件时出错,我的代码是这个 it('it should be possible to upload a file', function() {
System.loadLibrary("nativefaceswap"); 当我运行我的应用程序时,我在 Android Studio 中发现了此类错误。在logcat中显示: java.lang.U
我希望有人能帮助我!使用任何方法或命令行的任何 SSL/HTTPS 调用均无效。 我在 Windows 10 中使用 Ubuntu Server 18.04 作为子系统。我的问题是昨天才开始出现的,因
通过删除这两个值将日期字段从 null=True 和 Blank=True 更改为 required 时,使用 db.alter 命令时遇到问题。 当以下行被注释掉时,迁移运行不会出现问题。
我第一次使用 Heroku 尝试创建应用程序(使用 SendGrid 的 Inbound Parse Webhook"和 Twilio SMS 通过电子邮件发送和接收 SMS 消息)。通过 Virtu
我正在将我的 swift 项目更新到 Xcode 7 上的 Swift 2.0。xcode 在构建项目时报告了以下错误: 命令/Applications/Xcode.app/Contents/Deve
在我的代码中,SSL 库函数 SSL_library_init() 没有按预期返回 1。我如何才能看到它返回了什么错误? 我在 SSL_library_init() 之后调用了 SSL_load_er
我正在尝试运行在以下链接中找到的答案: Asynchronously Load the Contents of a Div 但是当我这样做时,我会遇到我不太理解的错误。 我的代码: $(documen
我是一名优秀的程序员,十分优秀!